Target
Multidrug resistance-associated protein 1
Ligand
BDBM50140874
Substrate
Meas. Tech.
ChEMBL_103771 (CHEMBL714751)
IC50
45±n/a nM
Citation
 Wang, SWan, NCHarrison, JMiller, WChuckowree, ISohal, SHancox, TCBaker, SFolkes, AWilson, FThompson, DCocks, SFarmer, HBoyce, AFreathy, CBroadbridge, JScott, JDepledge, PFaint, RMistry, PCharlton, P Design and synthesis of new templates derived from pyrrolopyrimidine as selective multidrug-resistance-associated protein inhibitors in multidrug resistance. J Med Chem 47:1339-50 (2004)  
Target
Name:
Multidrug resistance-associated protein 1
Synonyms:
7.6.2.2 ABCC1 ATP-binding cassette, sub-family C, member 1 isoform 1 LTC4 transporter MRP MRP1_HUMAN
Type:
Mol. Mass.:
171597.72
Organism:
Homo sapiens (Human)
Description:
P33527
Residue:
1531
  
Inhibitor
Name:
BDBM50140874
Synonyms:
8-{4-[2-(3,4-Difluoro-phenyl)-ethyl]-piperazin-1-yl}-9-methyl-9H-1,5,7,9-tetraaza-fluorene-4-carbonitrile | CHEMBL286948
Type:
Small organic molecule
Emp. Form.:
C23H21F2N7
Mol. Mass.:
433.4565
SMILES:
Cn1c2nccc(C#N)c2c2ncnc(N3CCN(CCc4ccc(F)c(F)c4)CC3)c12
: