Target
Multidrug resistance-associated protein 1
Ligand
BDBM50140867
Substrate
Meas. Tech.
ChEMBL_103771 (CHEMBL714751)
IC50
13±n/a nM
Citation
 Wang, SWan, NCHarrison, JMiller, WChuckowree, ISohal, SHancox, TCBaker, SFolkes, AWilson, FThompson, DCocks, SFarmer, HBoyce, AFreathy, CBroadbridge, JScott, JDepledge, PFaint, RMistry, PCharlton, P Design and synthesis of new templates derived from pyrrolopyrimidine as selective multidrug-resistance-associated protein inhibitors in multidrug resistance. J Med Chem 47:1339-50 (2004)  
Target
Name:
Multidrug resistance-associated protein 1
Synonyms:
7.6.2.2 ABCC1 ATP-binding cassette, sub-family C, member 1 isoform 1 LTC4 transporter MRP MRP1_HUMAN
Type:
Mol. Mass.:
171597.72
Organism:
Homo sapiens (Human)
Description:
P33527
Residue:
1531
  
Inhibitor
Name:
BDBM50140867
Synonyms:
9-Chloro-4-{4-[2-(3,4-difluoro-phenyl)-ethyl]-piperazin-1-yl}-2-methoxymethyl-5-methyl-5H-pyrido[3',4':4,5]pyrrolo[3,2-d]pyrimidine | CHEMBL25905
Type:
Small organic molecule
Emp. Form.:
C24H25ClF2N6O
Mol. Mass.:
486.945
SMILES:
COCc1nc(N2CCN(CCc3ccc(F)c(F)c3)CC2)c2n(C)c3ccnc(Cl)c3c2n1
: