Target
Multidrug resistance-associated protein 1
Ligand
BDBM50140854
Substrate
Meas. Tech.
ChEMBL_103771 (CHEMBL714751)
IC50
10±n/a nM
Citation
 Wang, SWan, NCHarrison, JMiller, WChuckowree, ISohal, SHancox, TCBaker, SFolkes, AWilson, FThompson, DCocks, SFarmer, HBoyce, AFreathy, CBroadbridge, JScott, JDepledge, PFaint, RMistry, PCharlton, P Design and synthesis of new templates derived from pyrrolopyrimidine as selective multidrug-resistance-associated protein inhibitors in multidrug resistance. J Med Chem 47:1339-50 (2004)  
Target
Name:
Multidrug resistance-associated protein 1
Synonyms:
7.6.2.2 ABCC1 ATP-binding cassette, sub-family C, member 1 isoform 1 LTC4 transporter MRP MRP1_HUMAN
Type:
Mol. Mass.:
171597.72
Organism:
Homo sapiens (Human)
Description:
P33527
Residue:
1531
  
Inhibitor
Name:
BDBM50140854
Synonyms:
8-{4-[2-(3,4-Difluoro-phenyl)-ethyl]-piperazin-1-yl}-9-methyl-6-morpholin-4-ylmethyl-9H-1,5,7,9-tetraaza-fluorene-4-carboxylic acid amide | CHEMBL281496
Type:
Small organic molecule
Emp. Form.:
C28H32F2N8O2
Mol. Mass.:
550.6029
SMILES:
Cn1c2nccc(C(N)=O)c2c2nc(CN3CCOCC3)nc(N3CCN(CCc4ccc(F)c(F)c4)CC3)c12
: