Target
Bcl-2-like protein 1
Ligand
BDBM31379
Substrate
Meas. Tech.
ChEBML_38726
Ki
1785±n/a nM
Citation
 Yin, HHamilton, AD Terephthalamide derivatives as mimetics of the helical region of Bak peptide target Bcl-xL protein. Bioorg Med Chem Lett 14:1375-9 (2004)  
Target
Name:
Bcl-2-like protein 1
Synonyms:
Anti-apoptotic Bcl-2 protein Apoptosis regulator Bcl-X BCL2-like 1 isoform 1 BCL2L1 Bcl-2-like protein 1 (Bcl-XL) Bcl-xL/Bcl-2-binding component 3 Bcl2-antagonist of cell death (BAD)
Type:
Mitochondrion membrane; Single-pass membrane protein
Mol. Mass.:
26039.60
Organism:
Homo sapiens (Human)
Description:
Residue:
233
  
Inhibitor
Name:
BDBM31379
Synonyms:
CHEMBL28872 | terephthalamide scaffold, 27
Type:
Small organic molecule
Emp. Form.:
C22H34N2O5
Mol. Mass.:
406.5158
SMILES:
COC(=O)[C@@H](CC(C)C)NC(=O)c1ccc(cc1OC)C(=O)N(C(C)C)C(C)C
: