Target
Bcl-2-like protein 1
Ligand
BDBM50141120
Substrate
Meas. Tech.
ChEBML_38726
Ki
>30000±n/a nM
Citation
 Yin, HHamilton, AD Terephthalamide derivatives as mimetics of the helical region of Bak peptide target Bcl-xL protein. Bioorg Med Chem Lett 14:1375-9 (2004)  
Target
Name:
Bcl-2-like protein 1
Synonyms:
Anti-apoptotic Bcl-2 protein Apoptosis regulator Bcl-X BCL2-like 1 isoform 1 BCL2L1 Bcl-2-like protein 1 (Bcl-XL) Bcl-xL/Bcl-2-binding component 3 Bcl2-antagonist of cell death (BAD)
Type:
Mitochondrion membrane; Single-pass membrane protein
Mol. Mass.:
26039.60
Organism:
Homo sapiens (Human)
Description:
Residue:
233
  
Inhibitor
Name:
BDBM50141120
Synonyms:
(S)-2-{4-[(1-Carboxy-2-methyl-propyl)-isobutyl-carbamoyl]-2-isopropoxy-benzoylamino}-4-methyl-pentanoic acid | CHEMBL286730
Type:
Small organic molecule
Emp. Form.:
C26H40N2O7
Mol. Mass.:
492.605
SMILES:
CC(C)C[C@H](NC(=O)c1ccc(cc1OC(C)C)C(=O)N(CC(C)C)C(C(C)C)C(O)=O)C(O)=O
: