Target
Melatonin receptor type 1A
Ligand
BDBM463445
Substrate
Meas. Tech.
ChEMBL_2125495 (CHEMBL4834840)
EC50
0.233000±n/a nM
Citation
 Ferreira, MAAzevedo, HMascarello, ASegretti, NDRusso, ERusso, VGuimarães, CRW Discovery of  J Med Chem 64:1904-1929 (2021)  
Target
Name:
Melatonin receptor type 1A
Synonyms:
MTNR1A MTR1A_HUMAN Mel1a melatonin receptor Melatonin receptor Melatonin receptor type 1 (MT1) | Melatonin receptor type 1A
Type:
Enzyme
Mol. Mass.:
39392.94
Organism:
Homo sapiens (Human)
Description:
P48039
Residue:
350
  
Inhibitor
Name:
BDBM463445
Synonyms:
US10781182, Compound IA2-140 | US11091445, Compound code IA2-140
Type:
Small organic molecule
Emp. Form.:
C14H19N3O3
Mol. Mass.:
277.319
SMILES:
COc1nc2ccc(OC)cc2n1CCCNC(C)=O
: