Target
Melatonin receptor type 1A
Ligand
BDBM50575514
Substrate
Meas. Tech.
ChEMBL_2125508 (CHEMBL4834853)
EC50
0.320000±n/a nM
Citation
 Ferreira, MAAzevedo, HMascarello, ASegretti, NDRusso, ERusso, VGuimarães, CRW Discovery of  J Med Chem 64:1904-1929 (2021)  
Target
Name:
Melatonin receptor type 1A
Synonyms:
MTNR1A MTR1A_HUMAN Mel1a melatonin receptor Melatonin receptor Melatonin receptor type 1 (MT1) | Melatonin receptor type 1A
Type:
Enzyme
Mol. Mass.:
39392.94
Organism:
Homo sapiens (Human)
Description:
P48039
Residue:
350
  
Inhibitor
Name:
BDBM50575514
Synonyms:
CHEMBL4852440
Type:
Small organic molecule
Emp. Form.:
C15H19N3O3
Mol. Mass.:
289.3297
SMILES:
CCOc1nc2ccc3OCCc3c2n1CCNC(C)=O
: