Target
Melatonin receptor type 1A
Ligand
BDBM463447
Substrate
Meas. Tech.
ChEMBL_2125508 (CHEMBL4834853)
EC50
0.250000±n/a nM
Citation
 Ferreira, MAAzevedo, HMascarello, ASegretti, NDRusso, ERusso, VGuimarães, CRW Discovery of  J Med Chem 64:1904-1929 (2021)  
Target
Name:
Melatonin receptor type 1A
Synonyms:
MTNR1A MTR1A_HUMAN Mel1a melatonin receptor Melatonin receptor Melatonin receptor type 1 (MT1) | Melatonin receptor type 1A
Type:
Enzyme
Mol. Mass.:
39392.94
Organism:
Homo sapiens (Human)
Description:
P48039
Residue:
350
  
Inhibitor
Name:
BDBM463447
Synonyms:
US10781182, Compound IA2-143 | US11091445, Compound code IA2-143
Type:
Small organic molecule
Emp. Form.:
C13H16ClN3O3
Mol. Mass.:
297.737
SMILES:
COc1nc2cc(Cl)c(OC)cc2n1CCNC(C)=O
: