Target
NEDD8-activating enzyme E1 catalytic subunit
Ligand
BDBM50575601
Substrate
Meas. Tech.
ChEMBL_2125645 (CHEMBL4834990)
IC50
203±n/a nM
Citation
 Langston, SPGrossman, SEngland, DAfroze, RBence, NBowman, DBump, NChau, RChuang, BCClaiborne, CCohen, LConnolly, KDuffey, MDurvasula, NFreeze, SGallery, MGalvin, KGaulin, JGershman, RGreenspan, PGrieves, JGuo, JGulavita, NHailu, SHe, XHoar, KHu, YHu, ZIto, MKim, MSLane, SWLok, DLublinsky, AMallender, WMcIntyre, CMinissale, JMizutani, HMizutani, MMolchinova, NOno, KPatil, AQian, MRiceberg, JShindi, VSintchak, MDSong, KSoucy, TWang, YXu, HYang, XZawadzka, AZhang, JPulukuri, SM Discovery of TAK-981, a First-in-Class Inhibitor of SUMO-Activating Enzyme for the Treatment of Cancer. J Med Chem 64:2501-2520 (2021)  
Target
Name:
NEDD8-activating enzyme E1 catalytic subunit
Synonyms:
6.2.1.- NEDD8-activating enzyme E1C UBA3_HUMAN Ubiquitin-activating enzyme 3 Ubiquitin-like modifier-activating enzyme 3
Type:
PROTEIN
Mol. Mass.:
51843.76
Organism:
Homo sapiens
Description:
ChEMBL_116863
Residue:
463
  
Inhibitor
Name:
BDBM50575601
Synonyms:
CHEMBL4858933
Type:
Small organic molecule
Emp. Form.:
C24H26ClN5O6S2
Mol. Mass.:
580.076
SMILES:
Cc1sc(cc1C1OCCc2ccc(Cl)nc12)C(=O)c1cncnc1N[C@H]1C[C@H](O)[C@@H](COS(N)(=O)=O)C1
: