Target
Melatonin receptor type 1A
Ligand
BDBM103443
Substrate
Meas. Tech.
ChEMBL_2125808 (CHEMBL4835153)
Ki
0.031000±n/a nM
Citation
 Hoashi, YTakai, TKosugi, YNakashima, MNakayama, MHirai, KUchikawa, OKoike, T Discovery of a Potent and Orally Bioavailable Melatonin Receptor Agonist. J Med Chem 64:3059-3074 (2021)  
Target
Name:
Melatonin receptor type 1A
Synonyms:
MTNR1A MTR1A_HUMAN Mel1a melatonin receptor Melatonin receptor Melatonin receptor type 1 (MT1) | Melatonin receptor type 1A
Type:
Enzyme
Mol. Mass.:
39392.94
Organism:
Homo sapiens (Human)
Description:
P48039
Residue:
350
  
Inhibitor
Name:
BDBM103443
Synonyms:
US8552037, 90
Type:
Small organic molecule
Emp. Form.:
C15H18N2O2
Mol. Mass.:
258.3156
SMILES:
CC(=O)NCC[C@@H]1CCc2ccc3nc(C)oc3c12
: