Target
A disintegrin and metalloproteinase with thrombospondin motifs 1
Ligand
BDBM50575689
Substrate
Meas. Tech.
ChEMBL_2125829 (CHEMBL4835174)
IC50
>20000±n/a nM
Citation
 Brebion, FGosmini, RDeprez, PVarin, MPeixoto, CAlvey, LJary, HBienvenu, NTriballeau, NBlanque, RCottereaux, CChristophe, TVandervoort, NMollat, PTouitou, RLeonard, PDe Ceuninck, FBotez, IMonjardet, Avan der Aar, EAmantini, D Discovery of GLPG1972/S201086, a Potent, Selective, and Orally Bioavailable ADAMTS-5 Inhibitor for the Treatment of Osteoarthritis. J Med Chem 64:2937-2952 (2021)  
Target
Name:
A disintegrin and metalloproteinase with thrombospondin motifs 1
Synonyms:
ADAMTS1 KIAA1346 | METH1
Type:
PROTEIN
Mol. Mass.:
105362.16
Organism:
Homo sapiens (Human)
Description:
ChEMBL_860059
Residue:
967
  
Inhibitor
Name:
BDBM50575689
Synonyms:
CHEMBL4850670
Type:
Small organic molecule
Emp. Form.:
C16H20N4O3
Mol. Mass.:
316.355
SMILES:
O=C(CCC1NC(=O)NC1=O)N1CCN(CC1)c1ccccc1
: