Target
A disintegrin and metalloproteinase with thrombospondin motifs 5
Ligand
BDBM379697
Substrate
Meas. Tech.
ChEMBL_2125867 (CHEMBL4835212)
IC50
<1500±n/a nM
Citation
 Brebion, FGosmini, RDeprez, PVarin, MPeixoto, CAlvey, LJary, HBienvenu, NTriballeau, NBlanque, RCottereaux, CChristophe, TVandervoort, NMollat, PTouitou, RLeonard, PDe Ceuninck, FBotez, IMonjardet, Avan der Aar, EAmantini, D Discovery of GLPG1972/S201086, a Potent, Selective, and Orally Bioavailable ADAMTS-5 Inhibitor for the Treatment of Osteoarthritis. J Med Chem 64:2937-2952 (2021)  
Target
Name:
A disintegrin and metalloproteinase with thrombospondin motifs 5
Synonyms:
3.4.24.- ADAM-TS 5 ADAMTS-5 ATS5_MOUSE Aggrecanase-2 | Implantin
Type:
PROTEIN
Mol. Mass.:
101888.97
Organism:
Mus musculus
Description:
ChEMBL_120487
Residue:
930
  
Inhibitor
Name:
BDBM379697
Synonyms:
US9926281, Compound 255
Type:
Small organic molecule
Emp. Form.:
C20H24F2N4O3
Mol. Mass.:
406.4264
SMILES:
C[C@H]1CN(CCN1c1cc(F)cc(F)c1)C(=O)CC[C@]1(NC(=O)NC1=O)C1CC1
: