Target
Melatonin receptor type 1A
Ligand
BDBM50142218
Substrate
Meas. Tech.
ChEBML_104949
Ki
34±n/a nM
Citation
 Epperson, JRDeskus, JAGentile, AJIben, LGRyan, ESarbin, NS 4-Substituted anilides as selective melatonin MT2 receptor agonists. Bioorg Med Chem Lett 14:1023-6 (2004)  
Target
Name:
Melatonin receptor type 1A
Synonyms:
MTNR1A MTR1A_HUMAN Mel1a melatonin receptor Melatonin receptor Melatonin receptor type 1 (MT1) | Melatonin receptor type 1A
Type:
Enzyme
Mol. Mass.:
39392.94
Organism:
Homo sapiens (Human)
Description:
P48039
Residue:
350
  
Inhibitor
Name:
BDBM50142218
Synonyms:
CHEMBL7556 | {4-[(3-Methoxy-phenyl)-methyl-amino]-phenyl}-carbamic acid ethyl ester
Type:
Small organic molecule
Emp. Form.:
C17H20N2O3
Mol. Mass.:
300.3523
SMILES:
CCOC(=O)Nc1ccc(cc1)N(C)c1cccc(OC)c1
: