Target
Melatonin receptor type 1A
Ligand
BDBM50142219
Substrate
Meas. Tech.
ChEBML_104949
Ki
61±n/a nM
Citation
 Epperson, JRDeskus, JAGentile, AJIben, LGRyan, ESarbin, NS 4-Substituted anilides as selective melatonin MT2 receptor agonists. Bioorg Med Chem Lett 14:1023-6 (2004)  
Target
Name:
Melatonin receptor type 1A
Synonyms:
MTNR1A MTR1A_HUMAN Mel1a melatonin receptor Melatonin receptor Melatonin receptor type 1 (MT1) | Melatonin receptor type 1A
Type:
Enzyme
Mol. Mass.:
39392.94
Organism:
Homo sapiens (Human)
Description:
P48039
Residue:
350
  
Inhibitor
Name:
BDBM50142219
Synonyms:
CHEMBL7215 | N-[4-(3-Methoxy-phenylamino)-phenyl]-propionamide
Type:
Small organic molecule
Emp. Form.:
C16H18N2O2
Mol. Mass.:
270.3263
SMILES:
CCC(=O)Nc1ccc(Nc2cccc(OC)c2)cc1
: