Target
Melatonin receptor type 1B
Ligand
BDBM50142233
Substrate
Meas. Tech.
ChEBML_105277
Ki
84±n/a nM
Citation
 Epperson, JRDeskus, JAGentile, AJIben, LGRyan, ESarbin, NS 4-Substituted anilides as selective melatonin MT2 receptor agonists. Bioorg Med Chem Lett 14:1023-6 (2004)  
Target
Name:
Melatonin receptor type 1B
Synonyms:
MTNR1B Mel-1B-R Melatonin 1B Melatonin receptor type 1B | Melatonin receptor type 2 (MT2)
Type:
Enzyme
Mol. Mass.:
40203.54
Organism:
Homo sapiens (Human)
Description:
P49286
Residue:
362
  
Inhibitor
Name:
BDBM50142233
Synonyms:
CHEMBL7874 | N-[4-(3-Methoxy-phenylamino)-phenyl]-isobutyramide
Type:
Small organic molecule
Emp. Form.:
C17H20N2O2
Mol. Mass.:
284.3529
SMILES:
COc1cccc(Nc2ccc(NC(=O)C(C)C)cc2)c1
: