Target
Melatonin receptor type 1B
Ligand
BDBM50142223
Substrate
Meas. Tech.
ChEBML_105277
Ki
5.5±n/a nM
Citation
 Epperson, JRDeskus, JAGentile, AJIben, LGRyan, ESarbin, NS 4-Substituted anilides as selective melatonin MT2 receptor agonists. Bioorg Med Chem Lett 14:1023-6 (2004)  
Target
Name:
Melatonin receptor type 1B
Synonyms:
MTNR1B Mel-1B-R Melatonin 1B Melatonin receptor type 1B | Melatonin receptor type 2 (MT2)
Type:
Enzyme
Mol. Mass.:
40203.54
Organism:
Homo sapiens (Human)
Description:
P49286
Residue:
362
  
Inhibitor
Name:
BDBM50142223
Synonyms:
CHEMBL7990 | N-{4-[(3-Methoxy-phenyl)-methyl-amino]-phenyl}-isobutyramide
Type:
Small organic molecule
Emp. Form.:
C18H22N2O2
Mol. Mass.:
298.3795
SMILES:
COc1cccc(c1)N(C)c1ccc(NC(=O)C(C)C)cc1
: