Target
Melatonin receptor type 1B
Ligand
BDBM50142227
Substrate
Meas. Tech.
ChEBML_105277
Ki
4.8±n/a nM
Citation
 Epperson, JRDeskus, JAGentile, AJIben, LGRyan, ESarbin, NS 4-Substituted anilides as selective melatonin MT2 receptor agonists. Bioorg Med Chem Lett 14:1023-6 (2004)  
Target
Name:
Melatonin receptor type 1B
Synonyms:
MTNR1B Mel-1B-R Melatonin 1B Melatonin receptor type 1B | Melatonin receptor type 2 (MT2)
Type:
Enzyme
Mol. Mass.:
40203.54
Organism:
Homo sapiens (Human)
Description:
P49286
Residue:
362
  
Inhibitor
Name:
BDBM50142227
Synonyms:
CHEMBL7567 | Cyclopropanecarboxylic acid {4-[(3-methoxy-phenyl)-methyl-amino]-phenyl}-amide
Type:
Small organic molecule
Emp. Form.:
C18H20N2O2
Mol. Mass.:
296.3636
SMILES:
COc1cccc(c1)N(C)c1ccc(NC(=O)C2CC2)cc1
: