Target
Melatonin receptor type 1B
Ligand
BDBM50142208
Substrate
Meas. Tech.
ChEBML_105277
Ki
0.750000±n/a nM
Citation
 Epperson, JRDeskus, JAGentile, AJIben, LGRyan, ESarbin, NS 4-Substituted anilides as selective melatonin MT2 receptor agonists. Bioorg Med Chem Lett 14:1023-6 (2004)  
Target
Name:
Melatonin receptor type 1B
Synonyms:
MTNR1B Mel-1B-R Melatonin 1B Melatonin receptor type 1B | Melatonin receptor type 2 (MT2)
Type:
Enzyme
Mol. Mass.:
40203.54
Organism:
Homo sapiens (Human)
Description:
P49286
Residue:
362
  
Inhibitor
Name:
BDBM50142208
Synonyms:
CHEMBL7599 | N-[4-(3-Methoxy-phenoxy)-phenyl]-butyramide
Type:
Small organic molecule
Emp. Form.:
C17H19NO3
Mol. Mass.:
285.3377
SMILES:
CCCC(=O)Nc1ccc(Oc2cccc(OC)c2)cc1
: