Target
Carboxypeptidase B2
Ligand
BDBM50575770
Substrate
Meas. Tech.
ChEMBL_2125968 (CHEMBL4835313)
IC50
5.0±n/a nM
Citation
 Schaffner, APSansilvestri-Morel, PDespaux, NRuano, EPersigand, TRupin, AMennecier, PVallez, MORaimbaud, EDesos, PGloanec, P Phosphinanes and Azaphosphinanes as Potent and Selective Inhibitors of Activated Thrombin-Activatable Fibrinolysis Inhibitor (TAFIa). J Med Chem 64:3897-3910 (2021)  
Target
Name:
Carboxypeptidase B2
Synonyms:
CBPB2_HUMAN CPU Carboxypeptidase B2 isoform A Plasma carboxypeptidase B Thrombin-activable fibrinolysis inhibitor | pCPB
Type:
Enzyme
Mol. Mass.:
48432.74
Organism:
Homo sapiens (Human)
Description:
Q96IY4
Residue:
423
  
Inhibitor
Name:
BDBM50575770
Synonyms:
CHEMBL4858095
Type:
Small organic molecule
Emp. Form.:
C22H30N3O5P
Mol. Mass.:
447.4645
SMILES:
COc1ccc(cn1)-c1ccccc1CN1CCP(O)(=O)[C@@](CCCCN)(C1)C(O)=O
: