Target
Gamma-aminobutyric acid receptor subunit alpha-6
Ligand
BDBM50142570
Substrate
Meas. Tech.
ChEBML_68403
Ki
66±n/a nM
Citation
 Crawforth, JAtack, JRCook, SMGibson, KRNadin, AOwens, APPike, ARowley, MSmith, AJSohal, BSternfeld, FWafford, KStreet, LJ Tricyclic pyridones as functionally selective human GABAA alpha 2/3 receptor-ion channel ligands. Bioorg Med Chem Lett 14:1679-82 (2004)  
Target
Name:
Gamma-aminobutyric acid receptor subunit alpha-6
Synonyms:
GABA A alpha6 GABRA6 | GBRA6_HUMAN
Type:
Enzyme Catalytic Domain
Mol. Mass.:
51029.60
Organism:
Homo sapiens (Human)
Description:
GABA A alpha6 0 HUMAN::Q16445
Residue:
453
  
Inhibitor
Name:
BDBM50142570
Synonyms:
9-(4-Methyl-thiazol-2-yl)-11-pyridin-4-yl-6,7-dihydro-5H-2,7a-diaza-dibenzo[a,c]cyclohepten-8-one | CHEMBL45198
Type:
Small organic molecule
Emp. Form.:
C22H18N4OS
Mol. Mass.:
386.47
SMILES:
Cc1csc(n1)-c1cc(-c2ccncc2)c2-c3cnccc3CCCn2c1=O
: