Target
Sodium/bile acid cotransporter
Ligand
BDBM50576164
Substrate
Meas. Tech.
ChEMBL_2126542 (CHEMBL4835887)
IC50
14±n/a nM
Citation
 Liu, YZhang, LYan, HWang, ZSun, GSong, XZhou, ZPeng, BYan, LWu, QLi, WQi, X Design of Dimeric Bile Acid Derivatives as Potent and Selective Human NTCP Inhibitors. J Med Chem 64:5973-6007 (2021)  
Target
Name:
Sodium/bile acid cotransporter
Synonyms:
Bile acid transporter NTCP_HUMAN | SLC10A1
Type:
PROTEIN
Mol. Mass.:
38131.81
Organism:
Homo sapiens (Human)
Description:
ChEMBL_838517
Residue:
349
  
Inhibitor
Name:
BDBM50576164
Synonyms:
CHEMBL4869726
Type:
Small organic molecule
Emp. Form.:
C55H91N5O11S2
Mol. Mass.:
1062.468
SMILES:
[H][C@@]1(CC[C@@]2([H])[C@]3([H])[C@@H](O)C[C@]4([H])C[C@@H](CC[C@]4(C)[C@@]3([H])CC[C@]12C)OCc1cn(nn1)[C@@H]1CC[C@@]2(C)[C@]([H])(C[C@H](O)[C@@]3([H])[C@]4([H])CC[C@]([H])([C@H](C)CCC(=O)NCCS(O)(=O)=O)[C@@]4(C)CC[C@]23[H])C1)[C@H](C)CCC(=O)NCCS(O)(=O)=O
: