Target
Sodium/bile acid cotransporter
Ligand
BDBM50576169
Substrate
Meas. Tech.
ChEMBL_2126559 (CHEMBL4835904)
IC50
82±n/a nM
Citation
 Liu, YZhang, LYan, HWang, ZSun, GSong, XZhou, ZPeng, BYan, LWu, QLi, WQi, X Design of Dimeric Bile Acid Derivatives as Potent and Selective Human NTCP Inhibitors. J Med Chem 64:5973-6007 (2021)  
Target
Name:
Sodium/bile acid cotransporter
Synonyms:
Bile acid transporter NTCP_HUMAN | SLC10A1
Type:
PROTEIN
Mol. Mass.:
38131.81
Organism:
Homo sapiens (Human)
Description:
ChEMBL_838517
Residue:
349
  
Inhibitor
Name:
BDBM50576169
Synonyms:
CHEMBL4865557
Type:
Small organic molecule
Emp. Form.:
C56H90N6O9S
Mol. Mass.:
1023.414
SMILES:
[H][C@]12CC[C@@]3([H])[C@]4([H])[C@@H](O)C[C@]5([H])C[C@@H](CC[C@]5(C)[C@@]4([H])CC[C@]13C)n1cc(CO[C@@H]3CC[C@@]4(C)[C@@]([H])(C3)C[C@H](O)[C@@]3([H])[C@]5([H])CC[C@]([H])([C@H](C)CCC(=O)NC(CNC(=O)CC[C@H]2C)C(=O)NCCS(O)(=O)=O)[C@@]5(C)CC[C@]43[H])nn1
: