Target
Glycine N-methyltransferase
Ligand
BDBM50576429
Substrate
Meas. Tech.
ChEMBL_2127252 (CHEMBL4836597)
IC50
2200±n/a nM
Citation
 Bobi?eva, OBobrovs, RKa?epe, IPatetko, LKalni??, G?i?ovs, MBula, ALGri Nberga, SBorodu??is, MRRamata-Stunda, ARostoks, NJirgensons, ATa Rs, KJaudzems, K Potent SARS-CoV-2 mRNA Cap Methyltransferase Inhibitors by Bioisosteric Replacement of Methionine in SAM Cosubstrate. ACS Med Chem Lett 12:1102-1107 (2021)  
Target
Name:
Glycine N-methyltransferase
Synonyms:
2.1.1.20 GNMT_HUMAN | Glycine N-methyltransferase
Type:
PROTEIN
Mol. Mass.:
32744.92
Organism:
Homo sapiens
Description:
ChEMBL_119045
Residue:
295
  
Inhibitor
Name:
BDBM50576429
Synonyms:
CHEMBL4857500
Type:
Small organic molecule
Emp. Form.:
C17H16N6O6
Mol. Mass.:
400.3455
SMILES:
Nc1ncnc2n(cnc12)[C@@H]1O[C@@H]([C@@H](O)[C@H]1O)C(=O)Nc1cccc(c1)C(O)=O
: