Target
Bromodomain-containing protein 3
Ligand
BDBM50576438
Substrate
Meas. Tech.
ChEMBL_2127272 (CHEMBL4836617)
IC50
1.3±n/a nM
Citation
 Lucas, SCCAtkinson, SJChung, CWDavis, RGordon, LGrandi, PGray, JJRGrimes, TPhillipou, APreston, AGPrinjha, RKRioja, ITaylor, STomkinson, NCOWall, IWatson, RJWoolven, JDemont, EH Optimization of a Series of 2,3-Dihydrobenzofurans as Highly Potent, Second Bromodomain (BD2)-Selective, Bromo and Extra-Terminal Domain (BET) Inhibitors. J Med Chem 64:10711-10741 (2021)  
Target
Name:
Bromodomain-containing protein 3
Synonyms:
BRD3 Bromodomain and extra-terminal motif (BET) Bromodomain-containing protein 3 (BRD3) RING3-like protein | RING3L
Type:
Protein
Mol. Mass.:
79571.81
Organism:
Homo sapiens (Human)
Description:
Q15059
Residue:
726
  
Inhibitor
Name:
BDBM50576438
Synonyms:
CHEMBL4869149
Type:
Small organic molecule
Emp. Form.:
C24H26N2O4
Mol. Mass.:
406.4742
SMILES:
[H][C@@]12C[C@@H](O)C[C@]1([H])[C@H]2NC(=O)c1cc2c(OC[C@@]2(C)c2ccccc2)c(c1)C(=O)NC
: