Target
Neuronal acetylcholine receptor subunit alpha-2/beta-4
Ligand
BDBM50100717
Substrate
Meas. Tech.
ChEMBL_143233 (CHEMBL750094)
Ki
3.30±n/a nM
Citation
 Carroll, FI Epibatidine structure-activity relationships. Bioorg Med Chem Lett 14:1889-96 (2004)  
Target
Name:
Neuronal acetylcholine receptor subunit alpha-2/beta-4
Synonyms:
Neuronal acetylcholine receptor Alpha-2/Beta-4 Neuronal acetylcholine receptor; alpha2/beta4 | nAChR subtypes alpha2 beta4
Type:
Protein
Mol. Mass.:
Description:
Components:
This complex has 2 components.
Component 1
Name:
Neuronal acetylcholine receptor subunit alpha-2
Synonyms:
ACHA2_RAT Cholinergic, Nicotinic Alpha2Beta2 Chrna2
Type:
Enzyme
Mol. Mass.:
58597.25
Organism:
Rattus norvegicus (Rat)
Description:
P12389
Residue:
511
  
Component 2
Name:
Neuronal acetylcholine receptor subunit beta-4
Synonyms:
ACHB4_RAT Chrnb4 Neuronal acetylcholine receptor non-alpha-2 chain | Neuronal acetylcholine receptor protein beta-4 subunit
Type:
Enzyme
Mol. Mass.:
55863.89
Organism:
Rattus norvegicus (Rat)
Description:
P12392
Residue:
495
  
Inhibitor
Name:
BDBM50100717
Synonyms:
2-(pyridin-3-yl)-7-aza-bicyclo[2.2.1]heptane CHEMBL56817
Type:
Small organic molecule
Emp. Form.:
C11H14N2
Mol. Mass.:
174.2423
SMILES:
C1CC2NC1CC2c1cccnc1
: