Target
Botulinum neurotoxin type A
Ligand
BDBM50576777
Substrate
Meas. Tech.
ChEMBL_2127791 (CHEMBL4837136)
IC50
800±n/a nM
Citation
 Turner, LDNielsen, ALLin, LCampedelli, AJSilvaggi, NRChen, JSWakefield, AEAllen, KNJanda, KD Use of Crystallography and Molecular Modeling for the Inhibition of the Botulinum Neurotoxin A Protease. ACS Med Chem Lett 12:1318-1324 (2021)  
Target
Name:
Botulinum neurotoxin type A
Synonyms:
BXA1_CLOBO bonT | botA
Type:
PROTEIN
Mol. Mass.:
149450.01
Organism:
Clostridium botulinum
Description:
ChEMBL_1510137
Residue:
1296
  
Inhibitor
Name:
BDBM50576777
Synonyms:
CHEMBL4854965
Type:
Small organic molecule
Emp. Form.:
C17H16Cl2N2O3
Mol. Mass.:
367.227
SMILES:
ONC(=O)CC(CC(=O)Nc1ccccc1)c1ccc(Cl)cc1Cl
: