Target
Cytochrome P450 3A4
Ligand
BDBM50576967
Substrate
Meas. Tech.
ChEMBL_2128577 (CHEMBL4838006)
Kd
5500±n/a nM
Citation
 Paquin, AOufqir, YSevrioukova, IFReyes-Moreno, CBérubé, G Innovative C Eur J Med Chem 220:0 (2021)  
Target
Name:
Cytochrome P450 3A4
Synonyms:
Albendazole monooxygenase CP3A4_HUMAN CYP3A4 CYPIIIA4 Cytochrome P450 3A4 (CYP3A4) Nifedipine oxidase Taurochenodeoxycholate 6-alpha-hydroxylase
Type:
Enzyme
Mol. Mass.:
57349.57
Organism:
Homo sapiens (Human)
Description:
Residue:
503
  
Inhibitor
Name:
BDBM50576967
Synonyms:
CHEMBL4862783
Type:
Small organic molecule
Emp. Form.:
C44H60O4
Mol. Mass.:
652.9448
SMILES:
[H][C@@]12CC[C@H](O)[C@@]1(C)CC[C@@]1([H])[C@@]2([H])[C@@H](CC2=CC(=O)CC[C@]12C)\C=C\C=C\C=C\[C@@H]1CC2=CC(=O)CC[C@]2(C)[C@@]2([H])CC[C@]3(C)[C@@H](O)CC[C@@]3([H])[C@]12[H]
: