Target
5-hydroxytryptamine receptor 1A
Ligand
BDBM50143664
Substrate
Meas. Tech.
ChEMBL_924 (CHEMBL615772)
Ki
61±n/a nM
Citation
 Leonardi, ABarlocco, DMontesano, FCignarella, GMotta, GTesta, RPoggesi, ESeeber, MDe Benedetti, PGFanelli, F Synthesis, screening, and molecular modeling of new potent and selective antagonists at the alpha 1d adrenergic receptor. J Med Chem 47:1900-18 (2004)  
Target
Name:
5-hydroxytryptamine receptor 1A
Synonyms:
5-HT-1A 5-hydroxytryptamine receptor 1A (5-HT-1A) ADRB2RL1 Dopamine D2 receptor and serotonin 1a receptor HTR1A | Serotonin receptor 1A
Type:
Mol. Mass.:
46122.49
Organism:
Homo sapiens (Human)
Description:
Residue:
422
  
Inhibitor
Name:
BDBM50143664
Synonyms:
8-{2-[4-(2,5-Difluoro-phenyl)-piperazin-1-yl]-ethyl}-8-aza-spiro[4.5]decane-7,9-dione | CHEMBL556313
Type:
Small organic molecule
Emp. Form.:
C21H27F2N3O2
Mol. Mass.:
391.4548
SMILES:
Fc1ccc(F)c(c1)N1CCN(CCN2C(=O)CC3(CCCC3)CC2=O)CC1
: