Target
Delta-type opioid receptor
Ligand
BDBM50144293
Substrate
Meas. Tech.
ChEBML_147341
Ki
0.720000±n/a nM
Citation
 Carson, JRCoats, SJCodd, EEDax, SLLee, JMartinez, RPMcKown, LAAnne Neilson, LPitis, PMWu, WNZhang, SP N-alkyl-4-[(8-azabicyclo[3.2.1]-oct-3-ylidene)phenylmethyl]benzamides, micro and delta opioid agonists: a micro address. Bioorg Med Chem Lett 14:2113-6 (2004)  
Target
Name:
Delta-type opioid receptor
Synonyms:
D-OR-1 Delta opioid receptor OPIATE Delta OPRD1 OPRK1 | opioid receptor, delta 1
Type:
G Protein-Coupled Receptor (GPCR)
Mol. Mass.:
40382.98
Organism:
Homo sapiens (Human)
Description:
Competition binding assays were carried out using membrane preparations from transfected HN9.10 cells that constitutively expressed the delta opioid receptor.
Residue:
372
  
Inhibitor
Name:
BDBM50144293
Synonyms:
CHEMBL67240 | N-Ethyl-4-{(3-methoxy-phenyl)-[8-(3-methyl-but-2-enyl)-8-aza-bicyclo[3.2.1]oct-3-ylidene]-methyl}-benzamide
Type:
Small organic molecule
Emp. Form.:
C29H36N2O2
Mol. Mass.:
444.6083
SMILES:
[#6]-[#6]-[#7]-[#6](=O)-c1ccc(cc1)-[#6](=[#6]-1\[#6]-[#6]-2-[#6]-[#6]-[#6](-[#6]-1)-[#7]-2-[#6]\[#6]=[#6](/[#6])-[#6])\c1cccc(-[#8]-[#6])c1
: