Target
Cytochrome P450 3A4
Ligand
BDBM50577263
Substrate
Meas. Tech.
ChEMBL_2129921 (CHEMBL4839350)
EC50
1900±n/a nM
Citation
 Spock, MCarter, TRBollinger, KAHan, CBaker, LARodriguez, ALPeng, LDickerson, JWQi, ARook, JMO'Neill, JCWatson, KJChang, SBridges, TMEngers, JLEngers, DWNiswender, CMConn, PJLindsley, CWBender, AM Discovery of VU6028418: A Highly Selective and Orally Bioavailable M ACS Med Chem Lett 12:1342-1349 (2021)  
Target
Name:
Cytochrome P450 3A4
Synonyms:
Albendazole monooxygenase CP3A4_HUMAN CYP3A4 CYPIIIA4 Cytochrome P450 3A4 (CYP3A4) Nifedipine oxidase Taurochenodeoxycholate 6-alpha-hydroxylase
Type:
Enzyme
Mol. Mass.:
57349.57
Organism:
Homo sapiens (Human)
Description:
Residue:
503
  
Inhibitor
Name:
BDBM50577263
Synonyms:
CHEMBL4850236
Type:
Small organic molecule
Emp. Form.:
C23H27F3N4O
Mol. Mass.:
432.4819
SMILES:
[H][C@@]12C[C@H](C[C@]1([H])CN(CC1CCOCC1)C2)Nc1ccc(nn1)-c1cc(F)cc(F)c1F
: