Target
DNA-dependent protein kinase catalytic subunit
Ligand
BDBM50577302
Substrate
Meas. Tech.
ChEMBL_2129934 (CHEMBL4839363)
IC50
32±n/a nM
Citation
 Berger, MWortmann, LBuchgraber, PLücking, UZitzmann-Kolbe, SWengner, AMBader, BBömer, UBriem, HEis, KRehwinkel, HBartels, FMoosmayer, DEberspächer, ULienau, PHammer, SSchatz, CAWang, QWang, QMumberg, DNising, CFSiemeister, G BAY-8400: A Novel Potent and Selective DNA-PK Inhibitor which Shows Synergistic Efficacy in Combination with Targeted Alpha Therapies. J Med Chem 64:12723-12737 (2021)  
Target
Name:
DNA-dependent protein kinase catalytic subunit
Synonyms:
DNA-PK catalytic subunit DNA-dependent protein kinase (DNA-PK) DNA-dependent protein kinase catalytic subunit (DNA-PK) HYRC PRKDC | PRKDC_HUMAN
Type:
Protein
Mol. Mass.:
469114.78
Organism:
Homo sapiens (Human)
Description:
P78527
Residue:
4128
  
Inhibitor
Name:
BDBM50577302
Synonyms:
CHEMBL4860129
Type:
Small organic molecule
Emp. Form.:
C22H21F2N5O
Mol. Mass.:
409.4318
SMILES:
CO[C@H]1CC[C@@H](CC1)c1nnc2cnc3ccc(cc3n12)-c1cncc(c1)C(F)F
: