Target
Serine-protein kinase ATM
Ligand
BDBM50577302
Substrate
Meas. Tech.
ChEMBL_2129936 (CHEMBL4839365)
IC50
>20000±n/a nM
Citation
 Berger, MWortmann, LBuchgraber, PLücking, UZitzmann-Kolbe, SWengner, AMBader, BBömer, UBriem, HEis, KRehwinkel, HBartels, FMoosmayer, DEberspächer, ULienau, PHammer, SSchatz, CAWang, QWang, QMumberg, DNising, CFSiemeister, G BAY-8400: A Novel Potent and Selective DNA-PK Inhibitor which Shows Synergistic Efficacy in Combination with Targeted Alpha Therapies. J Med Chem 64:12723-12737 (2021)  
Target
Name:
Serine-protein kinase ATM
Synonyms:
A-T mutated ATM_HUMAN | Ataxia telangiectasia mutated
Type:
Protein
Mol. Mass.:
350696.72
Organism:
Homo sapiens (Human)
Description:
Q13315
Residue:
3056
  
Inhibitor
Name:
BDBM50577302
Synonyms:
CHEMBL4860129
Type:
Small organic molecule
Emp. Form.:
C22H21F2N5O
Mol. Mass.:
409.4318
SMILES:
CO[C@H]1CC[C@@H](CC1)c1nnc2cnc3ccc(cc3n12)-c1cncc(c1)C(F)F
: