Target
Serine/threonine-protein kinase mTOR
Ligand
BDBM50577302
Substrate
Meas. Tech.
ChEMBL_2129937 (CHEMBL4839366)
IC50
3420±n/a nM
Citation
 Berger, MWortmann, LBuchgraber, PLücking, UZitzmann-Kolbe, SWengner, AMBader, BBömer, UBriem, HEis, KRehwinkel, HBartels, FMoosmayer, DEberspächer, ULienau, PHammer, SSchatz, CAWang, QWang, QMumberg, DNising, CFSiemeister, G BAY-8400: A Novel Potent and Selective DNA-PK Inhibitor which Shows Synergistic Efficacy in Combination with Targeted Alpha Therapies. J Med Chem 64:12723-12737 (2021)  
Target
Name:
Serine/threonine-protein kinase mTOR
Synonyms:
FK506-binding protein 12-rapamycin complex-associated protein 1 FRAP FRAP1 MTOR Mammalian Target of Rapamycin (mTOR) RAFT1 Rapamycin and FKBP12 target 1 Serine/threonine-protein kinase (mTOR) | mTORC2
Type:
Rapamycin target protein
Mol. Mass.:
288917.12
Organism:
Homo sapiens (Human)
Description:
P42345
Residue:
2549
  
Inhibitor
Name:
BDBM50577302
Synonyms:
CHEMBL4860129
Type:
Small organic molecule
Emp. Form.:
C22H21F2N5O
Mol. Mass.:
409.4318
SMILES:
CO[C@H]1CC[C@@H](CC1)c1nnc2cnc3ccc(cc3n12)-c1cncc(c1)C(F)F
: