Target
Tryptase beta-2/delta/gamma
Ligand
BDBM50144531
Substrate
Meas. Tech.
ChEMBL_210690 (CHEMBL817288)
IC50
29±n/a nM
Citation
 Bisacchi, GSSlusarchyk, WABolton, SAHartl, KSJacobs, GMathur, AMeng, WOgletree, MLPi, ZSutton, JCTreuner, UZahler, RZhao, GSeiler, SM Synthesis of potent and highly selective nonguanidine azetidinone inhibitors of human tryptase. Bioorg Med Chem Lett 14:2227-31 (2004)  
Target
Name:
Tryptase beta-2/delta/gamma
Synonyms:
Tryptase
Type:
Mol. Mass.:
Description:
ASSAY_ID of ChEMBL is 1510505
Components:
This complex has 3 components.
Component 1
Name:
Tryptase gamma
Synonyms:
PRSS31 TMT TRYG1_HUMAN Tryptase Tryptase gamma heavy chain | Tryptase gamma light chain
Type:
PROTEIN
Mol. Mass.:
33817.52
Organism:
Homo sapiens (Human)
Description:
ChEMBL_210833
Residue:
321
  
Component 2
Name:
Tryptase beta-2
Synonyms:
TPS2 TRYB2_HUMAN Tryptase II Tryptase-2
Type:
PROTEIN
Mol. Mass.:
30518.79
Organism:
Homo sapiens (Human)
Description:
ChEMBL_210702
Residue:
275
  
Component 3
Name:
Tryptase delta
Synonyms:
Delta-tryptase Mast cell mMCP-7-like TRYD_HUMAN Tryptase-3
Type:
PROTEIN
Mol. Mass.:
26578.73
Organism:
Homo sapiens (Human)
Description:
ChEMBL_104777
Residue:
242
  
Inhibitor
Name:
BDBM50144531
Synonyms:
4-((2S,3R)-2-Carboxy-4-oxo-3-piperidin-4-ylmethyl-azetidine-1-carbonyl)-piperazine-1-carboxylic acid 1-isopropyl-2-methyl-propyl ester | CHEMBL72279
Type:
Small organic molecule
Emp. Form.:
C23H38N4O6
Mol. Mass.:
466.571
SMILES:
CC(C)C(OC(=O)N1CCN(CC1)C(=O)N1[C@@H]([C@@H](CC2CCNCC2)C1=O)C(O)=O)C(C)C
: