Target
Tryptase beta-2/delta/gamma
Ligand
BDBM50120387
Substrate
Meas. Tech.
ChEMBL_210690 (CHEMBL817288)
IC50
<1.7±n/a nM
Citation
 Bisacchi, GSSlusarchyk, WABolton, SAHartl, KSJacobs, GMathur, AMeng, WOgletree, MLPi, ZSutton, JCTreuner, UZahler, RZhao, GSeiler, SM Synthesis of potent and highly selective nonguanidine azetidinone inhibitors of human tryptase. Bioorg Med Chem Lett 14:2227-31 (2004)  
Target
Name:
Tryptase beta-2/delta/gamma
Synonyms:
Tryptase
Type:
Mol. Mass.:
Description:
ASSAY_ID of ChEMBL is 1510505
Components:
This complex has 3 components.
Component 1
Name:
Tryptase gamma
Synonyms:
PRSS31 TMT TRYG1_HUMAN Tryptase Tryptase gamma heavy chain | Tryptase gamma light chain
Type:
PROTEIN
Mol. Mass.:
33817.52
Organism:
Homo sapiens (Human)
Description:
ChEMBL_210833
Residue:
321
  
Component 2
Name:
Tryptase beta-2
Synonyms:
TPS2 TRYB2_HUMAN Tryptase II Tryptase-2
Type:
PROTEIN
Mol. Mass.:
30518.79
Organism:
Homo sapiens (Human)
Description:
ChEMBL_210702
Residue:
275
  
Component 3
Name:
Tryptase delta
Synonyms:
Delta-tryptase Mast cell mMCP-7-like TRYD_HUMAN Tryptase-3
Type:
PROTEIN
Mol. Mass.:
26578.73
Organism:
Homo sapiens (Human)
Description:
ChEMBL_104777
Residue:
242
  
Inhibitor
Name:
BDBM50120387
Synonyms:
(2S,3R)-3-((R)-1-Carbamimidoyl-piperidin-3-ylmethyl)-4-oxo-1-[4-(6-phenyl-hexanoyl)-piperazine-1-carbonyl]-azetidine-2-carboxylic acid (2S,3R)-3-(1-Carbamimidoyl-piperidin-3-ylmethyl)-4-oxo-1-[4-(5-phenyl-pentanoyl)-piperazine-1-carbonyl]-azetidine-2-carboxylic acid CHEMBL303437
Type:
Small organic molecule
Emp. Form.:
C28H40N6O5
Mol. Mass.:
540.6544
SMILES:
NC(=N)N1CCC[C@H](C[C@@H]2[C@H](N(C(=O)N3CCN(CC3)C(=O)CCCCCc3ccccc3)C2=O)C(O)=O)C1
: