Target
Arginase-1
Ligand
BDBM50561036
Substrate
Meas. Tech.
ChEMBL_2130269 (CHEMBL4839698)
IC50
4.0±n/a nM
Citation
 Lu, MZhang, HLi, DChilders, MPu, QPalte, RLGathiaka, SLyons, TWPalani, AFan, PWSpacciapoli, PMiller, JRCho, HCheng, MChakravarthy, KO'Neil, JEangoor, PBeard, AKim, HYSaurí, JGunaydin, HSloman, DLSiliphaivanh, PCumming, JFischer, C Structure-Based Discovery of Proline-Derived Arginase Inhibitors with Improved Oral Bioavailability for Immuno-Oncology. ACS Med Chem Lett 12:1380-1388 (2021)  
Target
Name:
Arginase-1
Synonyms:
ARG1 Liver-type arginase | Type I arginase
Type:
PROTEIN
Mol. Mass.:
34737.53
Organism:
Homo sapiens (Human)
Description:
ChEMBL_978893
Residue:
322
  
Inhibitor
Name:
BDBM50561036
Synonyms:
CHEMBL4778978
Type:
Small organic molecule
Emp. Form.:
C8H16BNO5
Mol. Mass.:
217.027
SMILES:
OB(O)CCC[C@@H]1[C@@H](O)CN[C@@H]1C(O)=O
: