Target
Potassium voltage-gated channel subfamily H member 2
Ligand
BDBM50577482
Substrate
Meas. Tech.
ChEMBL_2130289 (CHEMBL4839718)
EC50
4400±n/a nM
Citation
 Rishton, GMLook, GCNi, ZJZhang, JWang, YHuang, YWu, XIzzo, NJLaBarbera, KMLimegrover, CSRehak, CYurko, RCatalano, SM Discovery of Investigational Drug CT1812, an Antagonist of the Sigma-2 Receptor Complex for Alzheimer's Disease. ACS Med Chem Lett 12:1389-1395 (2021)  
Target
Name:
Potassium voltage-gated channel subfamily H member 2
Synonyms:
1,3-beta-glucan synthase component GLS2 ERG Eag-related protein 1 Ether-a-go-go-related gene (HERG) Ether-a-go-go-related gene potassium channel 1 Ether-a-go-go-related gene potassium channel 1 (hERG1) Ether-a-go-go-related protein 1 H-ERG KCNH2 Potassium voltage-gated channel subfamily H member 2 (hERG) Voltage-gated potassium channel subunit Kv11.1 hERG Potassium Channel 1 | putative potassium channel subunit
Type:
Multi-pass membrane protein
Mol. Mass.:
126672.65
Organism:
Homo sapiens (Human)
Description:
Q12809
Residue:
1159
  
Inhibitor
Name:
BDBM50577482
Synonyms:
CHEMBL4848550
Type:
Small organic molecule
Emp. Form.:
C18H18Cl2F3N
Mol. Mass.:
376.243
SMILES:
C[C@H](CCc1ccc(Cl)c(Cl)c1)NCc1ccc(cc1)C(F)(F)F
: