Target
Sodium-dependent serotonin transporter
Ligand
BDBM50151982
Substrate
Meas. Tech.
ChEMBL_2131101 (CHEMBL4840616)
IC50
0.670000±n/a nM
Citation
 Xu, TXue, YLu, JJin, C Synthesis and biological evaluation of 1-(4-(piperazin-1-yl)phenyl)pyridin-2(1H)-one derivatives as potential SSRIs. Eur J Med Chem 223:0 (2021)  
Target
Name:
Sodium-dependent serotonin transporter
Synonyms:
5-HT Transporter 5HT transporter Anandamid membrane transporter, AMT Monoamine transporters; Norepinephrine & serotonin Slc6a4 Sodium-dependent serotonin transporter (SERT) | imipramine receptor
Type:
Multi-pass membrane protein
Mol. Mass.:
70168.43
Organism:
Rattus norvegicus (rat)
Description:
P31652
Residue:
630
  
Inhibitor
Name:
BDBM50151982
Synonyms:
5-{4-[4-(5-Cyano-1H-indol-3-yl)-butyl]-piperazin-1-yl}-benzofuran-2-carboxylic acid amide VILAZODONE
Type:
Small organic molecule
Emp. Form.:
C26H27N5O2
Mol. Mass.:
441.5249
SMILES:
NC(=O)c1cc2cc(ccc2o1)N1CCN(CCCCc2c[nH]c3ccc(cc23)C#N)CC1
: