Target
D(2) dopamine receptor
Ligand
BDBM50145018
Substrate
Meas. Tech.
ChEMBL_62877 (CHEMBL673588)
Ki
1160±n/a nM
Citation
 Berardi, FFerorelli, SAbate, CColabufo, NAContino, MPerrone, RTortorella, V 4-(tetralin-1-yl)- and 4-(naphthalen-1-yl)alkyl derivatives of 1-cyclohexylpiperazine as sigma receptor ligands with agonist sigma2 activity. J Med Chem 47:2308-17 (2004)  
Target
Name:
D(2) dopamine receptor
Synonyms:
DOPAMINE D2 DOPAMINE D2 Short Dopamine D2 receptor Drd2
Type:
G Protein-Coupled Receptor (GPCR)
Mol. Mass.:
50931.60
Organism:
Rattus norvegicus (rat)
Description:
P61169
Residue:
444
  
Inhibitor
Name:
BDBM50145018
Synonyms:
1-Cyclohexyl-4-(5-methoxy-1,2,3,4-tetrahydro-naphthalen-1-yl)-piperazine | CHEMBL309064
Type:
Small organic molecule
Emp. Form.:
C21H32N2O
Mol. Mass.:
328.4916
SMILES:
COc1cccc2C(CCCc12)N1CCN(CC1)C1CCCCC1
: