Target
5-hydroxytryptamine receptor 3A/3B
Ligand
BDBM50145013
Substrate
Meas. Tech.
ChEMBL_2998 (CHEMBL619788)
Ki
>700±n/a nM
Citation
 Berardi, FFerorelli, SAbate, CColabufo, NAContino, MPerrone, RTortorella, V 4-(tetralin-1-yl)- and 4-(naphthalen-1-yl)alkyl derivatives of 1-cyclohexylpiperazine as sigma receptor ligands with agonist sigma2 activity. J Med Chem 47:2308-17 (2004)  
Target
Name:
5-hydroxytryptamine receptor 3A/3B
Synonyms:
Serotonin 3 (5-HT3) receptor | Serotonin 3a (5-HT3a)/3b (5-HT3b) receptor
Type:
Mol. Mass.:
Description:
ASSAY_ID of EBI is 2974
Components:
This complex has 2 components.
Component 1
Name:
5-hydroxytryptamine receptor 3B
Synonyms:
5HT3B_RAT Serotonin (5-HT) receptor
Type:
PROTEIN
Mol. Mass.:
50328.78
Organism:
Rattus norvegicus
Description:
EBI_11885
Residue:
437
  
Component 2
Name:
5-hydroxytryptamine receptor 3A
Synonyms:
5-HT3 5HT3A_RAT Htr3 Serotonin (5-HT) receptor | Zacopride site-R
Type:
Enzyme Catalytic Domain
Mol. Mass.:
55428.70
Organism:
RAT
Description:
5-HT3 HTR3A RAT::P35563
Residue:
483
  
Inhibitor
Name:
BDBM50145013
Synonyms:
1-Cyclohexyl-4-[2-(5-methoxy-1,2,3,4-tetrahydro-naphthalen-1-yl)-ethyl]-piperazine | CHEMBL74858
Type:
Small organic molecule
Emp. Form.:
C23H36N2O
Mol. Mass.:
356.5447
SMILES:
COc1cccc2C(CCN3CCN(CC3)C3CCCCC3)CCCc12
: