Target
Sigma non-opioid intracellular receptor 1
Ligand
BDBM50145018
Substrate
Meas. Tech.
ChEMBL_200962 (CHEMBL802050)
Ki
0.4±n/a nM
Citation
 Berardi, FFerorelli, SAbate, CColabufo, NAContino, MPerrone, RTortorella, V 4-(tetralin-1-yl)- and 4-(naphthalen-1-yl)alkyl derivatives of 1-cyclohexylpiperazine as sigma receptor ligands with agonist sigma2 activity. J Med Chem 47:2308-17 (2004)  
Target
Name:
Sigma non-opioid intracellular receptor 1
Synonyms:
Aging-associated gene 8 protein SGMR1_HUMAN SIGMAR1 SR31747-binding protein Sigma 1-type opioid receptor Sigma1R | hSigmaR1
Type:
Enzyme Catalytic Domain
Mol. Mass.:
25124.85
Organism:
Homo sapiens (Human)
Description:
Q99720
Residue:
223
  
Inhibitor
Name:
BDBM50145018
Synonyms:
1-Cyclohexyl-4-(5-methoxy-1,2,3,4-tetrahydro-naphthalen-1-yl)-piperazine | CHEMBL309064
Type:
Small organic molecule
Emp. Form.:
C21H32N2O
Mol. Mass.:
328.4916
SMILES:
COc1cccc2C(CCCc12)N1CCN(CC1)C1CCCCC1
: