Target
5-hydroxytryptamine receptor 2A
Ligand
BDBM50145565
Substrate
Meas. Tech.
ChEMBL_2262 (CHEMBL617049)
EC50
64000±n/a nM
Citation
 Sabb, ALVogel, RLWelmaker, GSSabalski, JECoupet, JDunlop, JRosenzweig-Lipson, SHarrison, B Cycloalkyl[b][1,4]benzodiazepinoindoles are agonists at the human 5-HT2C receptor. Bioorg Med Chem Lett 14:2603-7 (2004)  
Target
Name:
5-hydroxytryptamine receptor 2A
Synonyms:
5-HT-2 5-HT2A 5-hydroxytryptamine receptor 2A (5HT-2A) 5HT2A_HUMAN HTR2A | Serotonin receptor 2A
Type:
undefined
Mol. Mass.:
52607.65
Organism:
Homo sapiens (Human)
Description:
P28223
Residue:
471
  
Inhibitor
Name:
BDBM50145565
Synonyms:
1,2,3,4,8,9,10,11,12,13-decahydrocycloocta[b][1,4]diazepino[6,7,1-hi]indole | CHEMBL89738
Type:
Small organic molecule
Emp. Form.:
C17H22N2
Mol. Mass.:
254.37
SMILES:
C1Cn2c3CCCCCCc3c3cccc(CN1)c23
: