Target
Interleukin-17A
Ligand
BDBM50578385
Substrate
Meas. Tech.
ChEMBL_2132782 (CHEMBL4842297)
IC50
3.0±n/a nM
Citation
 Sabnis, RW Novel Difluorocyclohexyl Derivatives as IL-17 Modulators for Treating Inflammatory and Autoimmune Diseases. ACS Med Chem Lett 12:1883-1884 (2021)  
Target
Name:
Interleukin-17A
Synonyms:
CTLA8 IL-17 IL17A il-17a
Type:
Enzyme Catalytic Domain
Mol. Mass.:
17511.44
Organism:
Homo sapiens (Human)
Description:
Q16552
Residue:
155
  
Inhibitor
Name:
BDBM50578385
Synonyms:
CHEMBL4851738
Type:
Small organic molecule
Emp. Form.:
C27H24F6N8O2
Mol. Mass.:
606.5223
SMILES:
Cc1nonc1C(=O)N[C@@H](C1CCC(F)(F)CC1)c1nc2c(F)c(ccc2[nH]1)[C@H](CC(F)F)c1nnc2ccc(F)cn12
: