Target
Muscarinic acetylcholine receptor M1
Ligand
BDBM50145685
Substrate
Meas. Tech.
ChEMBL_138402 (CHEMBL744764)
Ki
>10000±n/a nM
Citation
 Tagat, JRMcCombie, SWNazareno, DLabroli, MAXiao, YSteensma, RWStrizki, JMBaroudy, BMCox, KLachowicz, JVarty, GWatkins, R Piperazine-based CCR5 antagonists as HIV-1 inhibitors. IV. Discovery of 1-[(4,6-dimethyl-5-pyrimidinyl)carbonyl]- 4-[4-[2-methoxy-1(R)-4-(trifluoromethyl)phenyl]ethyl-3(S)-methyl-1-piperazinyl]- 4-methylpiperidine (Sch-417690/Sch-D), a potent, highly selective, and orally bioavailable CCR5 antagoni J Med Chem 47:2405-8 (2004)  
Target
Name:
Muscarinic acetylcholine receptor M1
Synonyms:
ACM1_HUMAN Cholinergic receptor, muscarinic 1 | Cholinergic, muscarinic M1
Type:
Protein
Mol. Mass.:
51442.54
Organism:
Homo sapiens (Human)
Description:
P11229
Residue:
460
  
Inhibitor
Name:
BDBM50145685
Synonyms:
(4,6-Dimethyl-pyrimidin-5-yl)-(4-{(S)-4-[(R)-2-methoxy-1-(4-trifluoromethyl-phenyl)-ethyl]-3-methyl-piperazin-1-yl}-4-methyl-piperidin-1-yl)-methanone | CHEMBL82301
Type:
Small organic molecule
Emp. Form.:
C28H38F3N5O2
Mol. Mass.:
533.6288
SMILES:
COC[C@H](N1CCN(C[C@@H]1C)C1(C)CCN(CC1)C(=O)c1c(C)ncnc1C)c1ccc(cc1)C(F)(F)F
: