Target
Urokinase-type plasminogen activator
Ligand
BDBM16173
Substrate
Meas. Tech.
ChEMBL_213140 (CHEMBL873997)
IC50
107000±n/a nM
Citation
 Joossens, JVan der Veken, PLambeir, AMAugustyns, KHaemers, A Development of irreversible diphenyl phosphonate inhibitors for urokinase plasminogen activator. J Med Chem 47:2411-3 (2004)  
Target
Name:
Urokinase-type plasminogen activator
Synonyms:
3.4.21.73 U-plasminogen activator Urokinase Urokinase-type plasminogen activator chain B Urokinase-type plasminogen activator short chain A uPA
Type:
Enzyme
Mol. Mass.:
48528.62
Organism:
Homo sapiens (Human)
Description:
P00749
Residue:
431
  
Inhibitor
Name:
BDBM16173
Synonyms:
3,5-diamino-6-chloro-N-(diaminomethylene)pyrazinamide;hydrochloride Amiloride CHEMBL945
Type:
Small organic molecule
Emp. Form.:
C6H8ClN7O
Mol. Mass.:
229.627
SMILES:
NC(=N)NC(=O)c1nc(Cl)c(N)nc1N
: