Target
Sodium-dependent serotonin transporter
Ligand
BDBM50578578
Substrate
Meas. Tech.
ChEMBL_2133328 (CHEMBL4842938)
IC50
135±n/a nM
Citation
 Staro?, JPietru?, WBugno, RKurczab, RSata?a, GWarszycki, DLenda, TWantuch, AHogendorf, ASHogendorf, ADuszy?ska, BBojarski, AJ Tuning the activity of known drugs via the introduction of halogen atoms, a case study of SERT ligands - Fluoxetine and fluvoxamine. Eur J Med Chem 220:0 (2021)  
Target
Name:
Sodium-dependent serotonin transporter
Synonyms:
5-HT Transporter 5HTT SC6A4_HUMAN SLC6A4 Serotonin transporter (5HTT) Sodium-dependent serotonin transporter (SERT) | Solute carrier family 6 member 4
Type:
Multi-pass membrane protein
Mol. Mass.:
70322.51
Organism:
Homo sapiens (Human)
Description:
P31645
Residue:
630
  
Inhibitor
Name:
BDBM50578578
Synonyms:
CHEMBL4851558
Type:
Small organic molecule
Emp. Form.:
C13H16ClNO
Mol. Mass.:
237.725
SMILES:
Clc1cccc(OC2CC3CCC(C2)N3)c1
: