Target
Proteinase-activated receptor 4
Ligand
BDBM50578823
Substrate
Meas. Tech.
ChEMBL_2134237 (CHEMBL4843847)
IC50
980±n/a nM
Citation
 Liu, SYuan, DLi, SXie, RKong, YZhu, X Synthesis and evaluation of novel and potent protease activated receptor 4 (PAR4) antagonists based on a quinazolin-4(3H)-one scaffold. Eur J Med Chem 225:0 (2021)  
Target
Name:
Proteinase-activated receptor 4
Synonyms:
Coagulation factor II receptor-like 3 PAR-4 Par4 Thrombin receptor-like 3
Type:
PROTEIN
Mol. Mass.:
42798.57
Organism:
Mus musculus
Description:
ChEMBL_120384
Residue:
396
  
Inhibitor
Name:
BDBM50578823
Synonyms:
CHEMBL4866983
Type:
Small organic molecule
Emp. Form.:
C19H15ClN2O2S
Mol. Mass.:
370.853
SMILES:
COc1cc(Cl)c2nc(sc2c1)-c1cc(C)cc2c1ccn(C)c2=O
: