Target
Proteinase-activated receptor 4
Ligand
BDBM50578850
Substrate
Meas. Tech.
ChEMBL_2134237 (CHEMBL4843847)
IC50
1000±n/a nM
Citation
 Liu, SYuan, DLi, SXie, RKong, YZhu, X Synthesis and evaluation of novel and potent protease activated receptor 4 (PAR4) antagonists based on a quinazolin-4(3H)-one scaffold. Eur J Med Chem 225:0 (2021)  
Target
Name:
Proteinase-activated receptor 4
Synonyms:
Coagulation factor II receptor-like 3 PAR-4 Par4 Thrombin receptor-like 3
Type:
PROTEIN
Mol. Mass.:
42798.57
Organism:
Mus musculus
Description:
ChEMBL_120384
Residue:
396
  
Inhibitor
Name:
BDBM50578850
Synonyms:
CHEMBL4867779
Type:
Small organic molecule
Emp. Form.:
C19H16ClN3O3S
Mol. Mass.:
401.867
SMILES:
COCn1cnc2c(cc(C)cc2c1=O)-c1nc2c(Cl)cc(OC)cc2s1
: