Target
Proteinase-activated receptor 4
Ligand
BDBM50578875
Substrate
Meas. Tech.
ChEMBL_2134237 (CHEMBL4843847)
IC50
520±n/a nM
Citation
 Liu, SYuan, DLi, SXie, RKong, YZhu, X Synthesis and evaluation of novel and potent protease activated receptor 4 (PAR4) antagonists based on a quinazolin-4(3H)-one scaffold. Eur J Med Chem 225:0 (2021)  
Target
Name:
Proteinase-activated receptor 4
Synonyms:
Coagulation factor II receptor-like 3 PAR-4 Par4 Thrombin receptor-like 3
Type:
PROTEIN
Mol. Mass.:
42798.57
Organism:
Mus musculus
Description:
ChEMBL_120384
Residue:
396
  
Inhibitor
Name:
BDBM50578875
Synonyms:
CHEMBL4855377
Type:
Small organic molecule
Emp. Form.:
C26H23ClN4O4S2
Mol. Mass.:
555.068
SMILES:
Cc1ccc(cc1)S(=O)(=O)NCCOc1cc(Cl)c2nc(sc2c1)-c1cc(C)cc2c1ncn(C)c2=O
: