Target
Proteinase-activated receptor 4
Ligand
BDBM364589
Substrate
Meas. Tech.
ChEMBL_2134237 (CHEMBL4843847)
IC50
1820±n/a nM
Citation
 Liu, SYuan, DLi, SXie, RKong, YZhu, X Synthesis and evaluation of novel and potent protease activated receptor 4 (PAR4) antagonists based on a quinazolin-4(3H)-one scaffold. Eur J Med Chem 225:0 (2021)  
Target
Name:
Proteinase-activated receptor 4
Synonyms:
Coagulation factor II receptor-like 3 PAR-4 Par4 Thrombin receptor-like 3
Type:
PROTEIN
Mol. Mass.:
42798.57
Organism:
Mus musculus
Description:
ChEMBL_120384
Residue:
396
  
Inhibitor
Name:
BDBM364589
Synonyms:
US9862730, Example 41
Type:
Small organic molecule
Emp. Form.:
C13H9N3OS
Mol. Mass.:
255.295
SMILES:
Cc1nn2cc(nc2s1)-c1cc2ccccc2o1
: